{"text_format":"1","workbook":"xlsx","n_sheets":9,"sheets":["Guidance","Inputs","Scenarios","Output_Top10","Assumptions","Used Values","Lookup_Performance","Lookup_Materials","Source_list"],"not_rendered":{"charts":6,"images":2,"macros":1,"external_links":1,"defined_names":2,"comments":0,"pivot_tables":1},"unopened":[],"bounds":{"document_bytes":16777216,"sheet_cells":100000,"rows_first":2000,"rows_last":500,"rows_between":2000,"halvings":0,"cell_chars":16384,"cell_head_chars":4096},"cells_cut":0,"cells_raw":0,"read":"whole","date_system":"1900"}

{"sheet":"Guidance","index":0,"n_rows":0,"n_cols":0,"rows_kept":0,"cut":false,"hidden":false,"merged":[]}

{"sheet":"Inputs","index":1,"n_rows":40,"n_cols":14,"rows_kept":40,"cut":false,"hidden":false,"merged":[[5,2,5,4],[24,2,24,7],[32,12,32,13]]}
[]
[]
[null,null,"Universal parameters"]
[null,null,null,"Default","User input"]
[null,null,"Target LCOE (€/MWh):",150,200]
[null,null,"Power capture"]
{"$rows_left_out":35}
{"sheet":"Scenarios","index":2,"n_rows":35,"n_cols":34,"rows_kept":35,"cut":false,"hidden":false,"merged":[[1,0,1,7],[1,22,1,23],[1,24,1,25],[1,26,1,29],[1,30,1,32]]}
[1,2,3,4,5,6,7,8,9,10,11,12,13,14,15,16,17,18,19,20,21,22,23,24,25,26,27,28,29,30,31,32,33,34]
["Scenarios",null,null,null,null,null,null,null,"Scenario characteristics",null,null,null,null,null,null,null,null,null,null,null,null,null,"Possible thresholds",null,"State-of-the-art thresholds",null,"Scores",null,null,null,"Filters",null,null,"Check"]
["0","Degree of Freedom","Shape","Material","Scale (m)","Resource (kW/m)","Efficiency (%)","CAPEX (€)","Availability (-)","Shape key (#)","Volume (m3)","Material key (#)","Material mass (kg)","Av. Power (kW)","Rated power (kW)","LCOE (€/MWh)","Structure (€)","PTO (€)","Mooring (€)","Connection (€)","Installation (€)","OPEX (€/a)","Possible Av. Power (kW)","Possible Structure Cost (€)","SOA Av. Power (kW)","SOA Structure Cost (€)","CA score","Power TA score","Cost TA score","TA score","Attractive (?)","Possible (?)","Achievable (?)","Meets minimums?"]
[1,{"$f":"Inputs!$E$7","v":"Heave"},"Cuboid","PU-nylon",10,55,0.01,2000000,{"$f":"LinInterpolate(TabScenarios[[#This Row],[Resource (kW/m)]],Assumptions!$K$3:$S$3,Assumptions!$K$5:$S$5)","v":0.76806703189470371},{"$f":"MATCH(TabScenarios[[#This Row],[Shape]],Inputs!$M$27:$M$30,0)","v":1},{"$f":"TabScenarios[[#This Row],[Scale (m)]]^3","v":1000},{"$f":"MATCH(TabScenarios[[#This Row],[Material]],Inputs!$M$19:$M$23,0)","v":5},{"$f":"TabScenarios[[#This Row],[Volume (m3)]]*INDEX(Lookup_Materials!$D$10:$D$15,TabScenarios[[#This Row],[Material key ('#)]])*(1+(TabScenarios[[#This Row],[Resource (kW/m)]]-Inputs!$F$21)/5*INDEX(Lookup_Materials!$G$10:$G$15,TabScenarios[[#This Row],[Material key ('#)]]))","v":5126.8796992481202},{"$f":"TabScenarios[[#This Row],[Scale (m)]]*TabScenarios[[#This Row],[Resource (kW/m)]]*TabScenarios[[#This Row],[Efficiency (%)]]","v":5.5},{"$f":"TabScenarios[[#This Row],[Av. Power (kW)]]/Assumptions!$C$7","v":18.333333333333336},{"$f":"IF(TabScenarios[[#This Row],[Av. Power (kW)]]>0,(TabScenarios[[#This Row],[CAPEX (€)]]/(1-'Used Values'!$D$15))/(TabScenarios[[#This Row],[Av. Power (kW)]]*TabScenarios[[#This Row],[Availability (-)]]*8.766*'Used Values'!$C$7),NA())","v":8504.2482231992872},{"$f":"TabScenarios[[#This Row],[CAPEX (€)]]*'Used Values'!$C$10","v":680000},{"$f":"TabScenarios[[#This Row],[CAPEX (€)]]*'Used Values'!$C$11","v":540000},{"$f":"TabScenarios[[#This Row],[CAPEX (€)]]*'Used Values'!$C$12","v":240000},{"$f":"TabScenarios[[#This Row],[CAPEX (€)]]*'Used Values'!$C$13","v":280000},{"$f":"TabScenarios[[#This Row],[CAPEX (€)]]*'Used Values'!$C$14","v":260000},{"$f":"TabScenarios[[#This Row],[CAPEX (€)]]*Assumptions!$C$5","v":80000},{"$f":"INDEX(('Used Values'!$M$5:$V$14,'Used Values'!$M$18:$V$27,'Used Values'!$M$31:$V$40,'Used Values'!$M$44:$V$53),MATCH(TabScenarios[[#This Row],[Scale (m)]],Inputs!$E$27:$E$36,0),MATCH(TabScenarios[[#This Row],[Resource (kW/m)]],Inputs!$F$27:$F$36,0),TabScenarios[[#This Row],[Shape key ('#)]])","v":433.5393206590536},{"$f":"TabScenarios[[#This Row],[Material mass (kg)]]*INDEX(Lookup_Materials!$E$10:$E$15,TabScenarios[[#This Row],[Material key ('#)]])","v":15021.757518796992},{"$f":"INDEX('Used Values'!$M$58:$V$67,MATCH(TabScenarios[[#This Row],[Scale (m)]],Inputs!$E$27:$E$36,0),MATCH(TabScenarios[[#This Row],[Resource (kW/m)]],Inputs!$F$27:$F$36,0))","v":69.243406995349275},{"$f":"TabScenarios[[#This Row],[Material mass (kg)]]*INDEX(Lookup_Materials!$F$10:$F$15,TabScenarios[[#This Row],[Material key ('#)]])","v":59112.922932330825},{"$f":"_xlfn.IFNA('Used Values'!$C$4/TabScenarios[[#This Row],[LCOE (€/MWh)]],0)","v":2.351765785180248E-2},{"$f":"(TabScenarios[[#This Row],[Possible Av. Power (kW)]]-TabScenarios[[#This Row],[Av. Power (kW)]])/(TabScenarios[[#This Row],[Possible Av. Power (kW)]]-TabScenarios[[#This Row],[SOA Av. Power (kW)]])*('Used Values'!$C$6)","v":2.3499540049971204},{"$f":"(TabScenarios[[#This Row],[Structure (€)]]-TabScenarios[[#This Row],[Possible Structure Cost (€)]])/(TabScenarios[[#This Row],[SOA Structure Cost (€)]]-TabScenarios[[#This Row],[Possible Structure Cost (€)]])*INDEX(Lookup_Materials!$H$10:$H$15,TabScenarios[[#This Row],[Material key ('#)]])","v":15.081893078677554},{"$f":"TabScenarios[[#This Row],[Power TA score]]+TabScenarios[[#This Row],[Cost TA score]]","v":17.431847083674676},{"$f":"IF(TabScenarios[[#This Row],[CA score]]<>\"\",TabScenarios[[#This Row],[CA score]]>=1,NA())","v":false},{"$f":"AND(TabScenarios[[#This Row],[Possible Av. Power (kW)]]-TabScenarios[[#This Row],[Av. Power (kW)]]>=0,TabScenarios[[#This Row],[Structure (€)]]-TabScenarios[[#This Row],[Possible Structure Cost (€)]]>=0)","v":true},{"$f":"AND(TabScenarios[[#This Row],[SOA Av. Power (kW)]]-TabScenarios[[#This Row],[Av. Power (kW)]]>=0,TabScenarios[[#This Row],[Structure (€)]]-TabScenarios[[#This Row],[SOA Structure Cost (€)]]>=0,TabScenarios[[#This Row],[Possible (?)]])","v":true},{"$f":"AND(TabScenarios[[#This Row],[Rated power (kW)]]*Assumptions!$C$10<=TabScenarios[[#This Row],[PTO (€)]],TabScenarios[[#This Row],[Rated power (kW)]]*Assumptions!$C$11<=TabScenarios[[#This Row],[Mooring (€)]],TabScenarios[[#This Row],[Rated power (kW)]]*Assumptions!$C$12<=TabScenarios[[#This Row],[Connection (€)]],TabScenarios[[#This Row],[Rated power (kW)]]*Assumptions!$C$13<=TabScenarios[[#This Row],[Installation (€)]],TabScenarios[[#This Row],[Rated power (kW)]]*Assumptions!$C$14<=TabScenarios[[#This Row],[OPEX (€/a)]])","v":true}]
[2,{"$f":"Inputs!$E$7","v":"Heave"},"Cuboid","PU-nylon",10,55,0.01,3000000,{"$f":"LinInterpolate(TabScenarios[[#This Row],[Resource (kW/m)]],Assumptions!$K$3:$S$3,Assumptions!$K$5:$S$5)","v":0.76806703189470371},{"$f":"MATCH(TabScenarios[[#This Row],[Shape]],Inputs!$M$27:$M$30,0)","v":1},{"$f":"TabScenarios[[#This Row],[Scale (m)]]^3","v":1000},{"$f":"MATCH(TabScenarios[[#This Row],[Material]],Inputs!$M$19:$M$23,0)","v":5},{"$f":"TabScenarios[[#This Row],[Volume (m3)]]*INDEX(Lookup_Materials!$D$10:$D$15,TabScenarios[[#This Row],[Material key ('#)]])*(1+(TabScenarios[[#This Row],[Resource (kW/m)]]-Inputs!$F$21)/5*INDEX(Lookup_Materials!$G$10:$G$15,TabScenarios[[#This Row],[Material key ('#)]]))","v":5126.8796992481202},{"$f":"TabScenarios[[#This Row],[Scale (m)]]*TabScenarios[[#This Row],[Resource (kW/m)]]*TabScenarios[[#This Row],[Efficiency (%)]]","v":5.5},{"$f":"TabScenarios[[#This Row],[Av. Power (kW)]]/Assumptions!$C$7","v":18.333333333333336},{"$f":"IF(TabScenarios[[#This Row],[Av. Power (kW)]]>0,(TabScenarios[[#This Row],[CAPEX (€)]]/(1-'Used Values'!$D$15))/(TabScenarios[[#This Row],[Av. Power (kW)]]*TabScenarios[[#This Row],[Availability (-)]]*8.766*'Used Values'!$C$7),NA())","v":12756.372334798931},{"$f":"TabScenarios[[#This Row],[CAPEX (€)]]*'Used Values'!$C$10","v":1020000.0000000001},{"$f":"TabScenarios[[#This Row],[CAPEX (€)]]*'Used Values'!$C$11","v":810000},{"$f":"TabScenarios[[#This Row],[CAPEX (€)]]*'Used Values'!$C$12","v":360000},{"$f":"TabScenarios[[#This Row],[CAPEX (€)]]*'Used Values'!$C$13","v":420000.00000000006},{"$f":"TabScenarios[[#This Row],[CAPEX (€)]]*'Used Values'!$C$14","v":390000},{"$f":"TabScenarios[[#This Row],[CAPEX (€)]]*Assumptions!$C$5","v":120000},{"$f":"INDEX(('Used Values'!$M$5:$V$14,'Used Values'!$M$18:$V$27,'Used Values'!$M$31:$V$40,'Used Values'!$M$44:$V$53),MATCH(TabScenarios[[#This Row],[Scale (m)]],Inputs!$E$27:$E$36,0),MATCH(TabScenarios[[#This Row],[Resource (kW/m)]],Inputs!$F$27:$F$36,0),TabScenarios[[#This Row],[Shape key ('#)]])","v":433.5393206590536},{"$f":"TabScenarios[[#This Row],[Material mass (kg)]]*INDEX(Lookup_Materials!$E$10:$E$15,TabScenarios[[#This Row],[Material key ('#)]])","v":15021.757518796992},{"$f":"INDEX('Used Values'!$M$58:$V$67,MATCH(TabScenarios[[#This Row],[Scale (m)]],Inputs!$E$27:$E$36,0),MATCH(TabScenarios[[#This Row],[Resource (kW/m)]],Inputs!$F$27:$F$36,0))","v":69.243406995349275},{"$f":"TabScenarios[[#This Row],[Material mass (kg)]]*INDEX(Lookup_Materials!$F$10:$F$15,TabScenarios[[#This Row],[Material key ('#)]])","v":59112.922932330825},{"$f":"_xlfn.IFNA('Used Values'!$C$4/TabScenarios[[#This Row],[LCOE (€/MWh)]],0)","v":1.5678438567868321E-2},{"$f":"(TabScenarios[[#This Row],[Possible Av. Power (kW)]]-TabScenarios[[#This Row],[Av. Power (kW)]])/(TabScenarios[[#This Row],[Possible Av. Power (kW)]]-TabScenarios[[#This Row],[SOA Av. Power (kW)]])*('Used Values'!$C$6)","v":2.3499540049971204},{"$f":"(TabScenarios[[#This Row],[Structure (€)]]-TabScenarios[[#This Row],[Possible Structure Cost (€)]])/(TabScenarios[[#This Row],[SOA Structure Cost (€)]]-TabScenarios[[#This Row],[Possible Structure Cost (€)]])*INDEX(Lookup_Materials!$H$10:$H$15,TabScenarios[[#This Row],[Material key ('#)]])","v":22.793188455225636},{"$f":"TabScenarios[[#This Row],[Power TA score]]+TabScenarios[[#This Row],[Cost TA score]]","v":25.143142460222755},{"$f":"IF(TabScenarios[[#This Row],[CA score]]<>\"\",TabScenarios[[#This Row],[CA score]]>=1,NA())","v":false},{"$f":"AND(TabScenarios[[#This Row],[Possible Av. Power (kW)]]-TabScenarios[[#This Row],[Av. Power (kW)]]>=0,TabScenarios[[#This Row],[Structure (€)]]-TabScenarios[[#This Row],[Possible Structure Cost (€)]]>=0)","v":true},{"$f":"AND(TabScenarios[[#This Row],[SOA Av. Power (kW)]]-TabScenarios[[#This Row],[Av. Power (kW)]]>=0,TabScenarios[[#This Row],[Structure (€)]]-TabScenarios[[#This Row],[SOA Structure Cost (€)]]>=0,TabScenarios[[#This Row],[Possible (?)]])","v":true},{"$f":"AND(TabScenarios[[#This Row],[Rated power (kW)]]*Assumptions!$C$10<=TabScenarios[[#This Row],[PTO (€)]],TabScenarios[[#This Row],[Rated power (kW)]]*Assumptions!$C$11<=TabScenarios[[#This Row],[Mooring (€)]],TabScenarios[[#This Row],[Rated power (kW)]]*Assumptions!$C$12<=TabScenarios[[#This Row],[Connection (€)]],TabScenarios[[#This Row],[Rated power (kW)]]*Assumptions!$C$13<=TabScenarios[[#This Row],[Installation (€)]],TabScenarios[[#This Row],[Rated power (kW)]]*Assumptions!$C$14<=TabScenarios[[#This Row],[OPEX (€/a)]])","v":true}]
[3,{"$f":"Inputs!$E$7","v":"Heave"},"Cuboid","PU-nylon",10,55,1,2000000,{"$f":"LinInterpolate(TabScenarios[[#This Row],[Resource (kW/m)]],Assumptions!$K$3:$S$3,Assumptions!$K$5:$S$5)","v":0.76806703189470371},{"$f":"MATCH(TabScenarios[[#This Row],[Shape]],Inputs!$M$27:$M$30,0)","v":1},{"$f":"TabScenarios[[#This Row],[Scale (m)]]^3","v":1000},{"$f":"MATCH(TabScenarios[[#This Row],[Material]],Inputs!$M$19:$M$23,0)","v":5},{"$f":"TabScenarios[[#This Row],[Volume (m3)]]*INDEX(Lookup_Materials!$D$10:$D$15,TabScenarios[[#This Row],[Material key ('#)]])*(1+(TabScenarios[[#This Row],[Resource (kW/m)]]-Inputs!$F$21)/5*INDEX(Lookup_Materials!$G$10:$G$15,TabScenarios[[#This Row],[Material key ('#)]]))","v":5126.8796992481202},{"$f":"TabScenarios[[#This Row],[Scale (m)]]*TabScenarios[[#This Row],[Resource (kW/m)]]*TabScenarios[[#This Row],[Efficiency (%)]]","v":550},{"$f":"TabScenarios[[#This Row],[Av. Power (kW)]]/Assumptions!$C$7","v":1833.3333333333335},{"$f":"IF(TabScenarios[[#This Row],[Av. Power (kW)]]>0,(TabScenarios[[#This Row],[CAPEX (€)]]/(1-'Used Values'!$D$15))/(TabScenarios[[#This Row],[Av. Power (kW)]]*TabScenarios[[#This Row],[Availability (-)]]*8.766*'Used Values'!$C$7),NA())","v":85.042482231992864},{"$f":"TabScenarios[[#This Row],[CAPEX (€)]]*'Used Values'!$C$10","v":680000},{"$f":"TabScenarios[[#This Row],[CAPEX (€)]]*'Used Values'!$C$11","v":540000},{"$f":"TabScenarios[[#This Row],[CAPEX (€)]]*'Used Values'!$C$12","v":240000},{"$f":"TabScenarios[[#This Row],[CAPEX (€)]]*'Used Values'!$C$13","v":280000},{"$f":"TabScenarios[[#This Row],[CAPEX (€)]]*'Used Values'!$C$14","v":260000},{"$f":"TabScenarios[[#This Row],[CAPEX (€)]]*Assumptions!$C$5","v":80000},{"$f":"INDEX(('Used Values'!$M$5:$V$14,'Used Values'!$M$18:$V$27,'Used Values'!$M$31:$V$40,'Used Values'!$M$44:$V$53),MATCH(TabScenarios[[#This Row],[Scale (m)]],Inputs!$E$27:$E$36,0),MATCH(TabScenarios[[#This Row],[Resource (kW/m)]],Inputs!$F$27:$F$36,0),TabScenarios[[#This Row],[Shape key ('#)]])","v":433.5393206590536},{"$f":"TabScenarios[[#This Row],[Material mass (kg)]]*INDEX(Lookup_Materials!$E$10:$E$15,TabScenarios[[#This Row],[Material key ('#)]])","v":15021.757518796992},{"$f":"INDEX('Used Values'!$M$58:$V$67,MATCH(TabScenarios[[#This Row],[Scale (m)]],Inputs!$E$27:$E$36,0),MATCH(TabScenarios[[#This Row],[Resource (kW/m)]],Inputs!$F$27:$F$36,0))","v":69.243406995349275},{"$f":"TabScenarios[[#This Row],[Material mass (kg)]]*INDEX(Lookup_Materials!$F$10:$F$15,TabScenarios[[#This Row],[Material key ('#)]])","v":59112.922932330825},{"$f":"_xlfn.IFNA('Used Values'!$C$4/TabScenarios[[#This Row],[LCOE (€/MWh)]],0)","v":2.3517657851802483},{"$f":"(TabScenarios[[#This Row],[Possible Av. Power (kW)]]-TabScenarios[[#This Row],[Av. Power (kW)]])/(TabScenarios[[#This Row],[Possible Av. Power (kW)]]-TabScenarios[[#This Row],[SOA Av. Power (kW)]])*('Used Values'!$C$6)","v":-0.63937406362705329},{"$f":"(TabScenarios[[#This Row],[Structure (€)]]-TabScenarios[[#This Row],[Possible Structure Cost (€)]])/(TabScenarios[[#This Row],[SOA Structure Cost (€)]]-TabScenarios[[#This Row],[Possible Structure Cost (€)]])*INDEX(Lookup_Materials!$H$10:$H$15,TabScenarios[[#This Row],[Material key ('#)]])","v":15.081893078677554},{"$f":"TabScenarios[[#This Row],[Power TA score]]+TabScenarios[[#This Row],[Cost TA score]]","v":14.4425190150505},{"$f":"IF(TabScenarios[[#This Row],[CA score]]<>\"\",TabScenarios[[#This Row],[CA score]]>=1,NA())","v":true},{"$f":"AND(TabScenarios[[#This Row],[Possible Av. Power (kW)]]-TabScenarios[[#This Row],[Av. Power (kW)]]>=0,TabScenarios[[#This Row],[Structure (€)]]-TabScenarios[[#This Row],[Possible Structure Cost (€)]]>=0)","v":false},{"$f":"AND(TabScenarios[[#This Row],[SOA Av. Power (kW)]]-TabScenarios[[#This Row],[Av. Power (kW)]]>=0,TabScenarios[[#This Row],[Structure (€)]]-TabScenarios[[#This Row],[SOA Structure Cost (€)]]>=0,TabScenarios[[#This Row],[Possible (?)]])","v":false},{"$f":"AND(TabScenarios[[#This Row],[Rated power (kW)]]*Assumptions!$C$10<=TabScenarios[[#This Row],[PTO (€)]],TabScenarios[[#This Row],[Rated power (kW)]]*Assumptions!$C$11<=TabScenarios[[#This Row],[Mooring (€)]],TabScenarios[[#This Row],[Rated power (kW)]]*Assumptions!$C$12<=TabScenarios[[#This Row],[Connection (€)]],TabScenarios[[#This Row],[Rated power (kW)]]*Assumptions!$C$13<=TabScenarios[[#This Row],[Installation (€)]],TabScenarios[[#This Row],[Rated power (kW)]]*Assumptions!$C$14<=TabScenarios[[#This Row],[OPEX (€/a)]])","v":false}]
{"$rows_left_out":30}
{"sheet":"Output_Top10","index":3,"n_rows":23,"n_cols":15,"rows_kept":23,"cut":false,"hidden":false,"merged":[[7,2,7,8],[1,7,1,10],[2,7,2,8],[2,9,2,10],[7,9,7,12]]}
[1,2,3,4,5,6,7,8,9,10,11,12,13,14,15]
[null,"Filters","No. of scenarios","As % of total","User control",null,null,"TA summary"]
[null,"No filters",{"$f":"Inputs!K37","v":32},{"$f":"C3/$C$3","v":1},null,null,null,"Power TA score",null,"Cost TA score"]
[null,"Attractive?:",{"$f":"COUNTIFS(TabScenarios[Attractive (?)],\"TRUE\")","v":16},{"$f":"C4/$C$3","v":0.5},null,1,null,"Max. TA score:",{"$f":"_xlfn.AGGREGATE(4,6,TabScenarios[Power TA score])","v":2.8264777790641933},"Max. TA score:",{"$f":"_xlfn.AGGREGATE(4,6,TabScenarios[Cost TA score])","v":22.793188455225636}]
[null,"Attractive & possible?:",{"$f":"COUNTIFS(TabScenarios[Attractive (?)],\"TRUE\",TabScenarios[Possible (?)],\"TRUE\")","v":2},{"$f":"C5/$C$3","v":6.25E-2},null,null,null,"Min TA score:",{"$f":"_xlfn.AGGREGATE(5,6,TabScenarios[Power TA score])","v":-0.95085030399891446},"Min TA score:",{"$f":"_xlfn.AGGREGATE(5,6,TabScenarios[Cost TA score])","v":-0.31934565941993293}]
[null,"Attractive & achievable?:",{"$f":"COUNTIFS(TabScenarios[Attractive (?)],\"TRUE\",TabScenarios[Achievable (?)],\"TRUE\")","v":0},{"$f":"C6/$C$3","v":0}]
{"$rows_left_out":18}
{"sheet":"Assumptions","index":4,"n_rows":25,"n_cols":19,"rows_kept":25,"cut":false,"hidden":false,"merged":[]}
[]
[null,"Assumptions","Input value",null,"τ",null,null,null,null,"Availability"]
[null,"Lifetime 'tlife' (yrs):",20,null,"tlife/r",0.05,0.1,0.15,null,"Resource (kW/m):",2.8549000000000002,9.15,17.197399999999998,26.626200000000001,38.392099999999999,54.5426,80.572000000000003,90,100]
[null,"Discount rate 'r':",0.1,null,15,10.379658038180599,7.6060795063083599,5.8473700986311004,null,"Accessability (-):",0.8,0.7,0.6,0.5,0.4,0.3,0.2,0.1767,0.15740000000000001]
[null,"OPEX (% of CAPEX per year):",0.04,null,20,12.462210342540001,8.5135637197585599,6.2593314737296497,null,"Availability (-):",0.96,0.95,0.93,0.9,0.85,0.77,0.66,0.63,0.61]
[null,"Resource penalty (per 5 kW/m):",0,null,25,14.093944566044801,9.0770400182293507,6.46414908527015]
{"$rows_left_out":20}
{"sheet":"Used Values","index":5,"n_rows":67,"n_cols":22,"rows_kept":67,"cut":false,"hidden":false,"merged":[[55,9,55,21],[55,8,56,8],[2,9,2,21],[41,9,41,21],[28,9,28,21],[15,9,15,21],[41,6,42,6],[2,8,3,8],[2,7,3,7],[41,5,42,5],[41,7,42,7],[41,8,42,8],[2,5,3,5],[15,5,16,5],[15,7,16,7],[15,8,16,8],[28,5,29,5],[28,7,29,7],[28,8,29,8],[2,6,3,6],[15,6,16,6],[28,6,29,6]]}
[]
[]
[null,"Universal Inputs","Used Value",null,null,"Shape key: 1","Column (#)","Scale (m)","Displaced volume [m3]","Possible Threshold: Av. Power (kW) @ Resource Level (kW/m)"]
[null,"Target LCOE (€/MWh):",{"$f":"IF(ISBLANK(Inputs!E5),Inputs!D5,Inputs!E5)","v":200},null,null,null,null,null,null,{"$f":"Lookup_Performance!$C$4","v":15},{"$f":"Lookup_Performance!$C$31","v":45},{"$f":"Lookup_Performance!$C$58","v":75},{"$f":"Inputs!$F$27","v":55},{"$f":"Inputs!$F$28","v":65},{"$f":"Inputs!$F$29","v":{"$error":"#N/A"}},{"$f":"Inputs!$F$30","v":{"$error":"#N/A"}},{"$f":"Inputs!$F$31","v":{"$error":"#N/A"}},{"$f":"Inputs!$F$32","v":{"$error":"#N/A"}},{"$f":"Inputs!$F$33","v":{"$error":"#N/A"}},{"$f":"Inputs!$F$34","v":{"$error":"#N/A"}},{"$f":"Inputs!$F$35","v":{"$error":"#N/A"}},{"$f":"Inputs!$F$36","v":{"$error":"#N/A"}}]
[null,"Degree of freedom:",{"$f":"Inputs!$E$7","v":"Heave"},null,null,{"$f":"Assumptions!$B$22&\"-\"&'Used Values'!$C$5","v":"Cuboid-Heave"},{"$f":"MATCH(F5,Lookup_Performance!$B$6:$BT$6,0)","v":7},{"$f":"Inputs!E27","v":10},{"$f":"H5^3*Assumptions!$C$22","v":500},{"$f":"LinInterpolate($I5,INDEX(Lookup_Performance!$B$8:$BT$29,N(IF(1,,{1,2,3,4,5,6,7,8,9,10})),$G5+1),INDEX(Lookup_Performance!$B$8:$BT$29,N(IF(1,,{1,2,3,4,5,6,7,8,9,10})),$G5),0)/1000","v":257.58615960942012},{"$f":"LinInterpolate($I5,INDEX(Lookup_Performance!$B$35:$BT$56,N(IF(1,,{1,2,3,4,5,6,7,8,9,10})),$G5+1),INDEX(Lookup_Performance!$B$35:$BT$56,N(IF(1,,{1,2,3,4,5,6,7,8,9,10})),$G5),0)/1000","v":402.00029597930899},{"$f":"LinInterpolate($I5,INDEX(Lookup_Performance!$B$62:$BT$83,N(IF(1,,{1,2,3,4,5,6,7,8,9,10})),$G5+1),INDEX(Lookup_Performance!$B$62:$BT$83,N(IF(1,,{1,2,3,4,5,6,7,8,9,10})),$G5),0)/1000","v":496.61737001854283},{"$f":"LinInterpolate(M$4,$J$4:$L$4,$J5:$L5)","v":433.5393206590536},{"$f":"LinInterpolate(N$4,$J$4:$L$4,$J5:$L5)","v":465.07834533879821},{"$error":"#VALUE!"},{"$error":"#VALUE!"},{"$error":"#VALUE!"},{"$error":"#VALUE!"},{"$error":"#VALUE!"},{"$error":"#VALUE!"},{"$error":"#VALUE!"},{"$f":"LinInterpolate(V$4,$J$4:$L$4,$J5:$L5)","v":{"$error":"#VALUE!"}}]
[null,"Energy capture β:",{"$f":"INDEX(Assumptions!$C$17:$C$19,MATCH(Inputs!$E$8,Assumptions!$B$17:$B$19,0))","v":2},null,null,{"$f":"Assumptions!$B$22&\"-\"&'Used Values'!$C$5","v":"Cuboid-Heave"},{"$f":"MATCH(F6,Lookup_Performance!$B$6:$BT$6,0)","v":7},{"$f":"Inputs!E28","v":40},{"$f":"H6^3*Assumptions!$C$22","v":32000},{"$f":"LinInterpolate($I6,INDEX(Lookup_Performance!$B$8:$BT$29,N(IF(1,,{1,2,3,4,5,6,7,8,9,10})),$G6+1),INDEX(Lookup_Performance!$B$8:$BT$29,N(IF(1,,{1,2,3,4,5,6,7,8,9,10})),$G6),0)/1000","v":1613.0257798191715},{"$f":"LinInterpolate($I6,INDEX(Lookup_Performance!$B$35:$BT$56,N(IF(1,,{1,2,3,4,5,6,7,8,9,10})),$G6+1),INDEX(Lookup_Performance!$B$35:$BT$56,N(IF(1,,{1,2,3,4,5,6,7,8,9,10})),$G6),0)/1000","v":2949.5564919681487},{"$f":"LinInterpolate($I6,INDEX(Lookup_Performance!$B$62:$BT$83,N(IF(1,,{1,2,3,4,5,6,7,8,9,10})),$G6+1),INDEX(Lookup_Performance!$B$62:$BT$83,N(IF(1,,{1,2,3,4,5,6,7,8,9,10})),$G6),0)/1000","v":6049.7508788985906},{"$f":"LinInterpolate(M$4,$J$4:$L$4,$J6:$L6)","v":3982.9546209449627},{"$f":"LinInterpolate(N$4,$J$4:$L$4,$J6:$L6)","v":5016.3527499217762},{"$error":"#VALUE!"},{"$error":"#VALUE!"},{"$error":"#VALUE!"},{"$error":"#VALUE!"},{"$error":"#VALUE!"},{"$error":"#VALUE!"},{"$error":"#VALUE!"},{"$error":"#VALUE!"}]
{"$rows_left_out":62}
{"sheet":"Lookup_Performance","index":6,"n_rows":128,"n_cols":72,"rows_kept":128,"cut":false,"hidden":false,"merged":[[116,1,117,1],[116,2,116,7],[1,1,1,4],[85,1,85,6],[88,1,89,1],[88,2,88,7],[102,1,103,1],[102,2,102,7]]}
[]
[null,"Possible average power by shape and DOF"]
[]
[null,"Resource level (kW/m):",15]
[null,1,2,3,4,5,6,7,8,9,10,11,12,13,14,15,16,17,18,19,20,21,22,23,24,25,26,27,28,29,30,31,32,33,34,35,36,37,38,39,40,41,42,43,44,45,46,47,48,49,50,51,52,53,54,55,56,57,58,59,60,61,62,63,64,65,66,67,68,69,70,71]
[null,"Cuboid-Surge","Displaced",null,"Cuboid-Pitch","Displaced",null,"Cuboid-Heave","Displaced",null,"Cuboid-Roll","Displaced",null,"Cuboid-Surge_Heave","Displaced",null,"Cuboid-Heave_Pitch","Displaced",null,"HCylinder-Surge","Displaced",null,"HCylinder-Pitch","Displaced",null,"HCylinder-Heave","Displaced",null,"HCylinder-Roll","Displaced",null,"HCylinder-Surge_Heave","Displaced",null,"HCylinder-Heave_Pitch","Displaced",null,"VCylinder-Surge","Displaced",null,"VCylinder-Pitch","Displaced",null,"VCylinder-Heave","Displaced",null,"VCylinder-Roll","Displaced",null,"VCylinder-Surge_Heave","Displaced",null,"VCylinder-Heave_Pitch","Displaced",null,"Sphere-Surge","Displaced",null,"Sphere-Pitch","Displaced",null,"Sphere-Heave","Displaced",null,"Sphere-Roll","Displaced",null,"Sphere-Surge_Heave","Displaced",null,"Sphere-Heave_Pitch","Displaced"]
{"$rows_left_out":123}
{"sheet":"Lookup_Materials","index":7,"n_rows":15,"n_cols":8,"rows_kept":15,"cut":false,"hidden":false,"merged":[]}
[]
[]
[null,null,"SOA-steel","κ"]
[null,null,"Default",278.76]
[null,null,"Upper",{"$f":"349.9","v":349.9}]
[null,null,"Lower",{"$f":"0.107679487179487*7800","v":839.89999999999861}]
{"$rows_left_out":10}
{"sheet":"Source_list","index":8,"n_rows":34,"n_cols":7,"rows_kept":34,"cut":false,"hidden":false,"merged":[]}
[]
[null,"Shape","Material","Scale (m)","Resource (kW/m)","Efficiency (%)","CAPEX (€)"]
[null,"Cuboid","PU-nylon",10,55,0.01,2000000]
[null,"Cuboid","PU-nylon",10,55,0.01,3000000]
[null,"Cuboid","PU-nylon",10,55,1,2000000]
[null,"Cuboid","PU-nylon",10,55,1,3000000]
{"$rows_left_out":28}